Reaction Details
TargetHeat shock factor protein 1
LigandBDBM50430022
Substrate/Competitorn/a
Meas. Tech.ChEMBL_1652055 (CHEMBL4001310)
IC50<10000±n/a nM
Citation Cheeseman, MDChessum, NERye, CSPasqua, AETucker, MJWilding, BEvans, LELepri, SRichards, MSharp, SYAli, SRowlands, MO'Fee, LMiah, AHayes, AHenley, ATPowers, MTe Poele, RDe Billy, EPellegrino, LRaynaud, FBurke, Rvan Montfort, RLEccles, SAWorkman, PJones, K Discovery of a Chemical Probe Bisamide (CCT251236): An Orally Bioavailable Efficacious Pirin Ligand from a Heat Shock Transcription Factor 1 (HSF1) Phenotypic Screen. J Med Chem60:180-201 (2017) 
 
Heat shock factor protein 1
Name:Heat shock factor protein 1
Type:PROTEIN
Mol. Mass.:57244.20
Organism:Homo sapiens (Human)
Description:ChEMBL_1512556
Residue:529
BDBM50430022
NameBDBM50430022
Synonyms:CHEMBL2144069
TypeSmall organic molecule
Emp. Form.C27H25N5O2
Mol. Mass.451.5197
SMILESCc1ccc(NC(=O)c2cccc(c2)C(C)(C)C#N)cc1Nc1ccc2ncn(C)c(=O)c2c1