Reaction Details
TargetHeat shock factor protein 1
LigandBDBM50234079
Substrate/Competitorn/a
Meas. Tech.ChEMBL_1652055 (CHEMBL4001310)
IC50 224±n/a nM
Citation Cheeseman, MDChessum, NERye, CSPasqua, AETucker, MJWilding, BEvans, LELepri, SRichards, MSharp, SYAli, SRowlands, MO'Fee, LMiah, AHayes, AHenley, ATPowers, MTe Poele, RDe Billy, EPellegrino, LRaynaud, FBurke, Rvan Montfort, RLEccles, SAWorkman, PJones, K Discovery of a Chemical Probe Bisamide (CCT251236): An Orally Bioavailable Efficacious Pirin Ligand from a Heat Shock Transcription Factor 1 (HSF1) Phenotypic Screen. J Med Chem60:180-201 (2017) 
 
Heat shock factor protein 1
Name:Heat shock factor protein 1
Type:PROTEIN
Mol. Mass.:57244.20
Organism:Homo sapiens (Human)
Description:ChEMBL_1512556
Residue:529
BDBM50234079
NameBDBM50234079
Synonyms:CHEMBL4096048 | US9701664, Example 80
TypeSmall organic molecule
Emp. Form.C26H25N3O4
Mol. Mass.443.4944
SMILESCc1ccc(NC(=O)c2ccc3OCCOc3c2)cc1NC(=O)c1ccc2NCCCc2c1