Reaction Details
TargetProthrombin
LigandBDBM50234836
Substrate/Competitorn/a
Meas. Tech.ChEMBL_1654041 (CHEMBL4003407)
IC50 0.840000±n/a nM
Citation Yang, HLiu, QGao, XRen, YGao, Y Novel dabigatran derivatives with a fluorine atom at the C-2 position of the terminal benzene ring: Design, synthesis and anticoagulant activity evaluation. Eur J Med Chem126:799-809 (2017) 
 
Prothrombin
Name:Prothrombin
Type:Protein
Mol. Mass.:70029.57
Organism:Homo sapiens (Human)
Description:P00734
Residue:622
BDBM50234836
NameBDBM50234836
Synonyms:CHEMBL4086267
TypeSmall organic molecule
Emp. Form.C26H23F3N6O3
Mol. Mass.524.4944
SMILESCn1c(CNc2ccc(cc2F)C(N)=N)nc2cc(ccc12)C(=O)N(CCC(O)=O)c1ccc(F)cc1F