Reaction Details
TargetMacrophage-stimulating protein receptor
LigandBDBM206104
Substrate/Competitorn/a
Meas. Tech.ChEMBL_1654843 (CHEMBL4004209)
IC50>50000±n/a nM
Citation Miura, TMatsuo, AMuraoka, TIde, MMorikami, KKamikawa, TNishihara, MKashiwagi, H Identification of a selective inhibitor of transforming growth factorß-activated kinase 1 by biosensor-based screening of focused libraries. Bioorg Med Chem Lett27:1031-1036 (2017) 
 
Macrophage-stimulating protein receptor
Name:Macrophage-stimulating protein receptor
Type:Protein
Mol. Mass.:152270.76
Organism:Homo sapiens (Human)
Description:Q04912
Residue:1400
BDBM206104
NameBDBM206104
Synonyms:US9255110, 17
TypeSmall organic molecule
Emp. Form.C17H12N4O2S
Mol. Mass.336.368
SMILESCOc1cc2ncccc2cc1NC(=O)c1csc2cncnc12