Reaction Details
TargetLeukocyte tyrosine kinase receptor
LigandBDBM206104
Substrate/Competitorn/a
Meas. Tech.ChEMBL_1654848 (CHEMBL4004214)
IC50>50000±n/a nM
Citation Miura, TMatsuo, AMuraoka, TIde, MMorikami, KKamikawa, TNishihara, MKashiwagi, H Identification of a selective inhibitor of transforming growth factorß-activated kinase 1 by biosensor-based screening of focused libraries. Bioorg Med Chem Lett27:1031-1036 (2017) 
 
Leukocyte tyrosine kinase receptor
Name:Leukocyte tyrosine kinase receptor
Type:PROTEIN
Mol. Mass.:91679.76
Organism:Homo sapiens (Human)
Description:ChEMBL_586334
Residue:864
BDBM206104
NameBDBM206104
Synonyms:US9255110, 17
TypeSmall organic molecule
Emp. Form.C17H12N4O2S
Mol. Mass.336.368
SMILESCOc1cc2ncccc2cc1NC(=O)c1csc2cncnc12