Reaction Details
TargetCytochrome P450 3A4
LigandBDBM50206243
Substrate/Competitorn/a
Meas. Tech.ChEMBL_1655348 (CHEMBL4004714)
IC50>40000±n/a nM
Citation King, DIwuagwu, CCook, JMcDonald, IMMate, RZusi, FCHill, MDFang, HZhao, RWang, BEaston, AEMiller, RPost-Munson, DKnox, RJGallagher, LWestphal, RMolski, TFan, JClarke, WBenitex, YLentz, KADenton, RMorgan, DZaczek, RLodge, NJBristow, LJMacor, JEOlson, RE BMS-933043, a Selectivea7 nAChR Partial Agonist for the Treatment of Cognitive Deficits Associated with Schizophrenia. ACS Med Chem Lett8:366-371 (2017) 
 
Cytochrome P450 3A4
Name:Cytochrome P450 3A4
Type:Enzyme
Mol. Mass.:57349.57
Organism:Homo sapiens (Human)
Description:n/a
Residue:503
BDBM50206243
NameBDBM50206243
Synonyms:CHEMBL3918431
TypeSmall organic molecule
Emp. Form.C18H20N4O
Mol. Mass.308.3776
SMILESC1N=C(Nc2cc3ccccc3cn2)O[C@]11CN2CCC1CC2