Reaction Details
TargetNeuronal acetylcholine receptor subunit alpha-7
LigandBDBM50235306
Substrate/Competitorn/a
Meas. Tech.ChEMBL_1655327 (CHEMBL4004693)
Ki 3.3±n/a nM
Citation King, DIwuagwu, CCook, JMcDonald, IMMate, RZusi, FCHill, MDFang, HZhao, RWang, BEaston, AEMiller, RPost-Munson, DKnox, RJGallagher, LWestphal, RMolski, TFan, JClarke, WBenitex, YLentz, KADenton, RMorgan, DZaczek, RLodge, NJBristow, LJMacor, JEOlson, RE BMS-933043, a Selectivea7 nAChR Partial Agonist for the Treatment of Cognitive Deficits Associated with Schizophrenia. ACS Med Chem Lett8:366-371 (2017) 
 
Neuronal acetylcholine receptor subunit alpha-7
Name:Neuronal acetylcholine receptor subunit alpha-7
Type:Enzyme
Mol. Mass.:56502.44
Organism:Rattus norvegicus (Rat)
Description:Q05941
Residue:502
BDBM50235306
NameBDBM50235306
Synonyms:CHEMBL4084621
TypeSmall organic molecule
Emp. Form.C16H19N7O
Mol. Mass.325.3684
SMILESC1N=C(Nc2cc(ncn2)-n2ccnc2)O[C@]11CN2CCC1CC2