Reaction Details
TargetDual specificity protein kinase CLK2
LigandBDBM50235816
Substrate/Competitorn/a
Meas. Tech.ChEMBL_1658086 (CHEMBL4007698)
IC50>10000±n/a nM
Citation Hoemann, MWilson, NArgiriadi, MBanach, DBurchat, ACalderwood, DClapham, BCox, PDuignan, DBKonopacki, DSomal, GVasudevan, A Synthesis and optimization of furano[3,2-d]pyrimidines as selective spleen tyrosine kinase (Syk) inhibitors. Bioorg Med Chem Lett26:5562-5567 (2016) 
 
Dual specificity protein kinase CLK2
Name:Dual specificity protein kinase CLK2
Type:n/a
Mol. Mass.:60128.79
Organism:Homo sapiens (Human)
Description:P49760
Residue:499
BDBM50235816
NameBDBM50235816
Synonyms:CHEMBL4069365
TypeSmall organic molecule
Emp. Form.C19H18F3N5O3
Mol. Mass.421.3731
SMILESCC1(C)OCC(=O)Nc2cc(Nc3nc(NCC(F)(F)F)c4occc4n3)ccc12