Reaction Details
TargetSerine/threonine-protein kinase TBK1
LigandBDBM50235817
Substrate/Competitorn/a
Meas. Tech.ChEMBL_1658138 (CHEMBL4007750)
IC50>10000±n/a nM
Citation Hoemann, MWilson, NArgiriadi, MBanach, DBurchat, ACalderwood, DClapham, BCox, PDuignan, DBKonopacki, DSomal, GVasudevan, A Synthesis and optimization of furano[3,2-d]pyrimidines as selective spleen tyrosine kinase (Syk) inhibitors. Bioorg Med Chem Lett26:5562-5567 (2016) 
 
Serine/threonine-protein kinase TBK1
Name:Serine/threonine-protein kinase TBK1
Type:protein
Mol. Mass.:83645.20
Organism:Homo sapiens (Human)
Description:Q9UHD2
Residue:729
BDBM50235817
NameBDBM50235817
Synonyms:CHEMBL4078893
TypeSmall organic molecule
Emp. Form.C18H17ClF3N5O2
Mol. Mass.427.808
SMILESFC(F)(F)CNc1nc(Nc2ccc(N3CCOCC3)c(Cl)c2)nc2ccoc12