Reaction Details
TargetTyrosine-protein kinase SYK
LigandBDBM50235824
Substrate/Competitorn/a
Meas. Tech.ChEMBL_1658035 (CHEMBL4007647)
IC50 64±n/a nM
Citation Hoemann, MWilson, NArgiriadi, MBanach, DBurchat, ACalderwood, DClapham, BCox, PDuignan, DBKonopacki, DSomal, GVasudevan, A Synthesis and optimization of furano[3,2-d]pyrimidines as selective spleen tyrosine kinase (Syk) inhibitors. Bioorg Med Chem Lett26:5562-5567 (2016) 
 
Tyrosine-protein kinase SYK
Name:Tyrosine-protein kinase SYK
Type:Enzyme
Mol. Mass.:72079.99
Organism:Homo sapiens (Human)
Description:P43405
Residue:635
BDBM50235824
NameBDBM50235824
Synonyms:CHEMBL4082961
TypeSmall organic molecule
Emp. Form.C21H25N5O3
Mol. Mass.395.4549
SMILESCC(C)CNc1nc(Nc2ccc3c(NC(=O)COC3(C)C)c2)nc2ccoc12