Reaction Details
TargetCalcium/calmodulin-dependent protein kinase type 1D
LigandBDBM50235816
Substrate/Competitorn/a
Meas. Tech.ChEMBL_1658077 (CHEMBL4007689)
IC50>10000±n/a nM
Citation Hoemann, MWilson, NArgiriadi, MBanach, DBurchat, ACalderwood, DClapham, BCox, PDuignan, DBKonopacki, DSomal, GVasudevan, A Synthesis and optimization of furano[3,2-d]pyrimidines as selective spleen tyrosine kinase (Syk) inhibitors. Bioorg Med Chem Lett26:5562-5567 (2016) 
 
Calcium/calmodulin-dependent protein kinase type 1D
Name:Calcium/calmodulin-dependent protein kinase type 1D
Type:PROTEIN
Mol. Mass.:42916.83
Organism:Homo sapiens (Human)
Description:ChEMBL_586559
Residue:385
BDBM50235816
NameBDBM50235816
Synonyms:CHEMBL4069365
TypeSmall organic molecule
Emp. Form.C19H18F3N5O3
Mol. Mass.421.3731
SMILESCC1(C)OCC(=O)Nc2cc(Nc3nc(NCC(F)(F)F)c4occc4n3)ccc12