Reaction Details
TargetDual specificity mitogen-activated protein kinase kinase 1
LigandBDBM50235833
Substrate/Competitorn/a
Meas. Tech.ChEMBL_1658114 (CHEMBL4007726)
IC50>10000±n/a nM
Citation Hoemann, MWilson, NArgiriadi, MBanach, DBurchat, ACalderwood, DClapham, BCox, PDuignan, DBKonopacki, DSomal, GVasudevan, A Synthesis and optimization of furano[3,2-d]pyrimidines as selective spleen tyrosine kinase (Syk) inhibitors. Bioorg Med Chem Lett26:5562-5567 (2016) 
 
Dual specificity mitogen-activated protein kinase kinase 1
Name:Dual specificity mitogen-activated protein kinase kinase 1
Type:Other Protein Type
Mol. Mass.:43439.03
Organism:Homo sapiens (Human)
Description:Full-length human MEK-1 was generated by PCR and purified as a fusion protein from Escherichia coli lysates.
Residue:393
BDBM50235833
NameBDBM50235833
Synonyms:CHEMBL4062803
TypeSmall organic molecule
Emp. Form.C17H16N6O
Mol. Mass.320.3485
SMILESCc1n[nH]c2cc(Nc3nc(NC4CC4)c4occc4n3)ccc12