Reaction Details
TargetHepatocyte growth factor-like protein
LigandBDBM50235816
Substrate/Competitorn/a
Meas. Tech.ChEMBL_1658116 (CHEMBL4007728)
IC50 2320±n/a nM
Citation Hoemann, MWilson, NArgiriadi, MBanach, DBurchat, ACalderwood, DClapham, BCox, PDuignan, DBKonopacki, DSomal, GVasudevan, A Synthesis and optimization of furano[3,2-d]pyrimidines as selective spleen tyrosine kinase (Syk) inhibitors. Bioorg Med Chem Lett26:5562-5567 (2016) 
 
Hepatocyte growth factor-like protein
Name:Hepatocyte growth factor-like protein
Type:PROTEIN
Mol. Mass.:80336.23
Organism:Homo sapiens (Human)
Description:ChEMBL_101427
Residue:711
BDBM50235816
NameBDBM50235816
Synonyms:CHEMBL4069365
TypeSmall organic molecule
Emp. Form.C19H18F3N5O3
Mol. Mass.421.3731
SMILESCC1(C)OCC(=O)Nc2cc(Nc3nc(NCC(F)(F)F)c4occc4n3)ccc12