Reaction Details
TargetHepatocyte growth factor-like protein
LigandBDBM50235833
Substrate/Competitorn/a
Meas. Tech.ChEMBL_1658116 (CHEMBL4007728)
IC50>10000±n/a nM
Citation Hoemann, MWilson, NArgiriadi, MBanach, DBurchat, ACalderwood, DClapham, BCox, PDuignan, DBKonopacki, DSomal, GVasudevan, A Synthesis and optimization of furano[3,2-d]pyrimidines as selective spleen tyrosine kinase (Syk) inhibitors. Bioorg Med Chem Lett26:5562-5567 (2016) 
 
Hepatocyte growth factor-like protein
Name:Hepatocyte growth factor-like protein
Type:PROTEIN
Mol. Mass.:80336.23
Organism:Homo sapiens (Human)
Description:ChEMBL_101427
Residue:711
BDBM50235833
NameBDBM50235833
Synonyms:CHEMBL4062803
TypeSmall organic molecule
Emp. Form.C17H16N6O
Mol. Mass.320.3485
SMILESCc1n[nH]c2cc(Nc3nc(NC4CC4)c4occc4n3)ccc12