Reaction Details
TargetTyrosine-protein kinase ABL1
LigandBDBM50235830
Substrate/Competitorn/a
Meas. Tech.ChEMBL_1658068 (CHEMBL4007680)
IC50 1200±n/a nM
Citation Hoemann, MWilson, NArgiriadi, MBanach, DBurchat, ACalderwood, DClapham, BCox, PDuignan, DBKonopacki, DSomal, GVasudevan, A Synthesis and optimization of furano[3,2-d]pyrimidines as selective spleen tyrosine kinase (Syk) inhibitors. Bioorg Med Chem Lett26:5562-5567 (2016) 
 
Tyrosine-protein kinase ABL1
Name:Tyrosine-protein kinase ABL1
Type:Enzyme
Mol. Mass.:122897.30
Organism:Homo sapiens (Human)
Description:P00519
Residue:1130
BDBM50235830
NameBDBM50235830
Synonyms:CHEMBL2006765
TypeSmall organic molecule
Emp. Form.C18H19F3N6O
Mol. Mass.392.3783
SMILESCCCNC(=O)c1ccc(Nc2nc(NCC(F)(F)F)c3cc[nH]c3n2)cc1