Reaction Details
TargetTyrosine-protein kinase receptor TYRO3
LigandBDBM50235820
Substrate/Competitorn/a
Meas. Tech.ChEMBL_1658144 (CHEMBL4007756)
IC50 3210±n/a nM
Citation Hoemann, MWilson, NArgiriadi, MBanach, DBurchat, ACalderwood, DClapham, BCox, PDuignan, DBKonopacki, DSomal, GVasudevan, A Synthesis and optimization of furano[3,2-d]pyrimidines as selective spleen tyrosine kinase (Syk) inhibitors. Bioorg Med Chem Lett26:5562-5567 (2016) 
 
Tyrosine-protein kinase receptor TYRO3
Name:Tyrosine-protein kinase receptor TYRO3
Type:Protein
Mol. Mass.:96894.13
Organism:Homo sapiens (Human)
Description:Q06418
Residue:890
BDBM50235820
NameBDBM50235820
Synonyms:CHEMBL4066664
TypeSmall organic molecule
Emp. Form.C15H11F3N6O
Mol. Mass.348.2826
SMILESFC(F)(F)CNc1nc(Nc2ccc3cn[nH]c3c2)nc2ccoc12