Reaction Details
TargetHepatocyte growth factor-like protein
LigandBDBM50235830
Substrate/Competitorn/a
Meas. Tech.ChEMBL_1658116 (CHEMBL4007728)
IC50 177±n/a nM
Citation Hoemann, MWilson, NArgiriadi, MBanach, DBurchat, ACalderwood, DClapham, BCox, PDuignan, DBKonopacki, DSomal, GVasudevan, A Synthesis and optimization of furano[3,2-d]pyrimidines as selective spleen tyrosine kinase (Syk) inhibitors. Bioorg Med Chem Lett26:5562-5567 (2016) 
 
Hepatocyte growth factor-like protein
Name:Hepatocyte growth factor-like protein
Type:PROTEIN
Mol. Mass.:80336.23
Organism:Homo sapiens (Human)
Description:ChEMBL_101427
Residue:711
BDBM50235830
NameBDBM50235830
Synonyms:CHEMBL2006765
TypeSmall organic molecule
Emp. Form.C18H19F3N6O
Mol. Mass.392.3783
SMILESCCCNC(=O)c1ccc(Nc2nc(NCC(F)(F)F)c3cc[nH]c3n2)cc1