Reaction Details
TargetDual specificity mitogen-activated protein kinase kinase 2
LigandBDBM50235820
Substrate/Competitorn/a
Meas. Tech.ChEMBL_1658115 (CHEMBL4007727)
IC50>10000±n/a nM
Citation Hoemann, MWilson, NArgiriadi, MBanach, DBurchat, ACalderwood, DClapham, BCox, PDuignan, DBKonopacki, DSomal, GVasudevan, A Synthesis and optimization of furano[3,2-d]pyrimidines as selective spleen tyrosine kinase (Syk) inhibitors. Bioorg Med Chem Lett26:5562-5567 (2016) 
 
Dual specificity mitogen-activated protein kinase kinase 2
Name:Dual specificity mitogen-activated protein kinase kinase 2
Type:Enzyme Catalytic Domain
Mol. Mass.:44423.61
Organism:Homo sapiens (Human)
Description:gi_13489054
Residue:400
BDBM50235820
NameBDBM50235820
Synonyms:CHEMBL4066664
TypeSmall organic molecule
Emp. Form.C15H11F3N6O
Mol. Mass.348.2826
SMILESFC(F)(F)CNc1nc(Nc2ccc3cn[nH]c3c2)nc2ccoc12