Reaction Details
TargetDeath-associated protein kinase 3
LigandBDBM50235817
Substrate/Competitorn/a
Meas. Tech.ChEMBL_1658146 (CHEMBL4007758)
IC50>10000±n/a nM
Citation Hoemann, MWilson, NArgiriadi, MBanach, DBurchat, ACalderwood, DClapham, BCox, PDuignan, DBKonopacki, DSomal, GVasudevan, A Synthesis and optimization of furano[3,2-d]pyrimidines as selective spleen tyrosine kinase (Syk) inhibitors. Bioorg Med Chem Lett26:5562-5567 (2016) 
 
Death-associated protein kinase 3
Name:Death-associated protein kinase 3
Type:PROTEIN
Mol. Mass.:52537.07
Organism:Homo sapiens (Human)
Description:ChEMBL_586564
Residue:454
BDBM50235817
NameBDBM50235817
Synonyms:CHEMBL4078893
TypeSmall organic molecule
Emp. Form.C18H17ClF3N5O2
Mol. Mass.427.808
SMILESFC(F)(F)CNc1nc(Nc2ccc(N3CCOCC3)c(Cl)c2)nc2ccoc12