Reaction Details
TargetHepatocyte growth factor-like protein
LigandBDBM50235817
Substrate/Competitorn/a
Meas. Tech.ChEMBL_1658116 (CHEMBL4007728)
IC50 9080±n/a nM
Citation Hoemann, MWilson, NArgiriadi, MBanach, DBurchat, ACalderwood, DClapham, BCox, PDuignan, DBKonopacki, DSomal, GVasudevan, A Synthesis and optimization of furano[3,2-d]pyrimidines as selective spleen tyrosine kinase (Syk) inhibitors. Bioorg Med Chem Lett26:5562-5567 (2016) 
 
Hepatocyte growth factor-like protein
Name:Hepatocyte growth factor-like protein
Type:PROTEIN
Mol. Mass.:80336.23
Organism:Homo sapiens (Human)
Description:ChEMBL_101427
Residue:711
BDBM50235817
NameBDBM50235817
Synonyms:CHEMBL4078893
TypeSmall organic molecule
Emp. Form.C18H17ClF3N5O2
Mol. Mass.427.808
SMILESFC(F)(F)CNc1nc(Nc2ccc(N3CCOCC3)c(Cl)c2)nc2ccoc12