Reaction Details
TargetCytoplasmic tyrosine-protein kinase BMX
LigandBDBM50236072
Substrate/Competitorn/a
Meas. Tech.ChEMBL_1658703 (CHEMBL4008315)
IC50 37±n/a nM
Citation Liang, XLv, FWang, BYu, KWu, HQi, ZJiang, ZChen, CWang, AMiao, WWang, WHu, ZLiu, JLiu, XZhao, ZWang, LZhang, SYe, ZWang, CRen, TWang, YLiu, QLiu, J Discovery of 2-((3-Acrylamido-4-methylphenyl)amino)-N-(2-methyl-5-(3,4,5-trimethoxybenzamido)phenyl)-4-(methylamino)pyrimidine-5-carboxamide (CHMFL-BMX-078) as a Highly Potent and Selective Type II Irreversible Bone Marrow Kinase in the X Chromosome (BMX) Kinase Inhibitor. J Med Chem60:1793-1816 (2017) 
 
Cytoplasmic tyrosine-protein kinase BMX
Name:Cytoplasmic tyrosine-protein kinase BMX
Type:Tyrosine-protein kinase
Mol. Mass.:78030.42
Organism:Homo sapiens (Human)
Description:P51813
Residue:675
BDBM50236072
NameBDBM50236072
Synonyms:CHEMBL4064566
TypeSmall organic molecule
Emp. Form.C31H28F3N7O3
Mol. Mass.603.5943
SMILESCNc1nc(Nc2ccc(C)c(NC(=O)C=C)c2)ncc1C(=O)Nc1cc(NC(=O)c2cccc(c2)C(F)(F)F)ccc1C