Reaction Details
TargetcGMP-dependent 3',5'-cyclic phosphodiesterase
LigandBDBM50236241
Substrate/Competitorn/a
Meas. Tech.ChEMBL_1658902 (CHEMBL4008514)
IC50 10±n/a nM
Citation Gomez, LMassari, MEVickers, TFreestone, GVernier, WLy, KXu, RMcCarrick, MMarrone, TMetz, MYan, YGYoder, ZWLemus, RBroadbent, NJBarido, RWarren, NSchmelzer, KNeul, DLee, DAndersen, CBSebring, KAertgeerts, KZhou, XTabatabaei, APeters, MBreitenbucher, JG Design and Synthesis of Novel and Selective Phosphodiesterase 2 (PDE2a) Inhibitors for the Treatment of Memory Disorders. J Med Chem60:2037-2051 (2017) 
 
cGMP-dependent 3',5'-cyclic phosphodiesterase
Name:cGMP-dependent 3',5'-cyclic phosphodiesterase
Type:Enzyme Catalytic Domain
Mol. Mass.:105691.58
Organism:Homo sapiens (Human)
Description:O00408
Residue:941
BDBM50236241
NameBDBM50236241
Synonyms:CHEMBL4069050 | US11186582, Example 481
TypeSmall organic molecule
Emp. Form.C20H23N5O2
Mol. Mass.365.4289
SMILESCOc1ccc(cc1C)C(=O)N1CCCC(C1)c1cc(C)nc2ncnn12