Reaction Details
TargetcGMP-dependent 3',5'-cyclic phosphodiesterase
LigandBDBM50236239
Substrate/Competitorn/a
Meas. Tech.ChEMBL_1658902 (CHEMBL4008514)
IC50 47±n/a nM
Citation Gomez, LMassari, MEVickers, TFreestone, GVernier, WLy, KXu, RMcCarrick, MMarrone, TMetz, MYan, YGYoder, ZWLemus, RBroadbent, NJBarido, RWarren, NSchmelzer, KNeul, DLee, DAndersen, CBSebring, KAertgeerts, KZhou, XTabatabaei, APeters, MBreitenbucher, JG Design and Synthesis of Novel and Selective Phosphodiesterase 2 (PDE2a) Inhibitors for the Treatment of Memory Disorders. J Med Chem60:2037-2051 (2017) 
 
cGMP-dependent 3',5'-cyclic phosphodiesterase
Name:cGMP-dependent 3',5'-cyclic phosphodiesterase
Type:Enzyme Catalytic Domain
Mol. Mass.:105691.58
Organism:Homo sapiens (Human)
Description:O00408
Residue:941
BDBM50236239
NameBDBM50236239
Synonyms:CHEMBL4095653 | US11186582, Example 338
TypeSmall organic molecule
Emp. Form.C22H21N5O
Mol. Mass.371.435
SMILESCc1cc([C@@H]2CCCN(C2)C(=O)c2ccc3ccccc3c2)n2ncnc2n1