Reaction Details
TargetD(3) dopamine receptor
LigandBDBM60994
Substrate/Competitorn/a
Meas. Tech.ChEMBL_1659130 (CHEMBL4008742)
EC50 10±n/a nM
Citation De Simone, ARusso, DRuda, GFMicoli, AFerraro, MDi Martino, RMOttonello, GSumma, MArmirotti, ABandiera, TCavalli, ABottegoni, G Design, Synthesis, Structure-Activity Relationship Studies, and Three-Dimensional Quantitative Structure-Activity Relationship (3D-QSAR) Modeling of a Series of O-Biphenyl Carbamates as Dual Modulators of Dopamine D3 Receptor and Fatty Acid Amide Hydrolase. J Med Chem60:2287-2304 (2017) 
 
D(3) dopamine receptor
Name:D(3) dopamine receptor
Type:n/a
Mol. Mass.:44243.43
Organism:Homo sapiens (Human)
Description:n/a
Residue:400
BDBM60994
NameBDBM60994
Synonyms:(10R,10aR)-6,6,9-Trimethyl-3-pentyl-6a,7,8,10a-tetrahydro-6H-benzo[c]chromen-1-ol 1N-[2-(5-dimethylaminomethyl-2-furylmethylsulfanyl)ethyl]-1N-methyl-2-nitro-(Z)-1-ethene-1,1-diamine 6,6,9-Trimethyl-3-pentyl-6a,7,8,10a-tetrahydro-6H-benzo[c]chromen-1-ol(DeltaE-9-THC) 8,8-Dimethyl-11-methylene-5-pentyl-3,4,8a,9,10,11,12,12a-octahydro-2H,8H-1,7-dioxa-benzo[c]phenanthrene BDBM50007391 DRONABINOL Tetrahydrocannabinol delta-9-THC delta-9-Tetrahydrocannabinol (THC) delta9-tetrahydrocannabinol
Typen/a
Emp. Form.C21H30O2
Mol. Mass.314.4617
SMILESCCCCCc1cc(O)c2[C@@H]3C=C(C)CC[C@H]3C(C)(C)Oc2c1