Reaction Details
TargetSignal transducer and activator of transcription 3
LigandBDBM50236733
Substrate/Competitorn/a
Meas. Tech.ChEMBL_1660397 (CHEMBL4010009)
Ki 2420±n/a nM
Citation Yu, WLi, CZhang, WXia, YLi, SLin, JYYu, KLiu, MYang, LLuo, JChen, YSun, HKong, L Discovery of an Orally Selective Inhibitor of Signal Transducer and Activator of Transcription 3 Using Advanced Multiple Ligand Simultaneous Docking. J Med Chem60:2718-2731 (2017) 
 
Signal transducer and activator of transcription 3
Name:Signal transducer and activator of transcription 3
Type:Protein
Mol. Mass.:88064.31
Organism:Homo sapiens (Human)
Description:P40763
Residue:770
BDBM50236733
NameBDBM50236733
Synonyms:CHEMBL4096680
TypeSmall organic molecule
Emp. Form.C20H20N4O4S
Mol. Mass.412.462
SMILESNS(=O)(=O)c1cccc2C(=O)C(Nc3ccccc3N3CCNCC3)=CC(=O)c12