Reaction Details
TargetMitogen-activated protein kinase 1
LigandBDBM50237672
Substrate/Competitorn/a
Meas. Tech.ChEMBL_1662272 (CHEMBL4011953)
IC50 61±n/a nM
Citation Irie, TAsami, TSawa, AUno, YHanada, MTaniyama, CFunakoshi, YMasai, HSawa, M Discovery of novel furanone derivatives as potent Cdc7 kinase inhibitors. Eur J Med Chem130:406-418 (2017) 
 
Mitogen-activated protein kinase 1
Name:Mitogen-activated protein kinase 1
Type:Ser/Thr Protein Kinase
Mol. Mass.:41392.76
Organism:Homo sapiens (Human)
Description:P28482
Residue:360
BDBM50237672
NameBDBM50237672
Synonyms:CHEMBL4089159
TypeSmall organic molecule
Emp. Form.C20H14ClN3O4
Mol. Mass.395.796
SMILESCOC(=O)C1=C(Nc2ccccc2Cl)O\C(=C/c2c[nH]c3ncccc23)C1=O