Reaction Details
TargetCytochrome P450 2C9
LigandBDBM231435
Substrate/Competitorn/a
Meas. Tech.ChEMBL_1662649 (CHEMBL4012330)
IC50 250±n/a nM
Citation Graceffa, RFBoezio, AAAble, JAltmann, SBerry, LMBoezio, CButler, JRChu-Moyer, MCooke, MDiMauro, EFDineen, TAFeric Bojic, EFoti, RSFremeau, RTGuzman-Perez, AGao, HGunaydin, HHuang, HHuang, LIlch, CJarosh, MKornecook, TKreiman, CRLa, DSLigutti, JMilgram, BCLin, MJMarx, IENguyen, HNPeterson, EARescourio, GRoberts, JSchenkel, LShimanovich, RSparling, BAStellwagen, JTaborn, KVaida, KRWang, JYeoman, JYu, VZhu, DMoyer, BDWeiss, MM Sulfonamides as Selective Na J Med Chem60:5990-6017 (2017) 
 
Cytochrome P450 2C9
Name:Cytochrome P450 2C9
Type:Enzyme
Mol. Mass.:55636.33
Organism:Homo sapiens (Human)
Description:P11712
Residue:490
BDBM231435
NameBDBM231435
Synonyms:US9346798, 182
TypeSmall organic molecule
Emp. Form.C19H16F3N3O4S2
Mol. Mass.471.473
SMILESCOc1cc(ccc1N1CCOc2cc(ccc12)S(=O)(=O)Nc1nccs1)C(F)(F)F