Reaction Details
TargetSodium channel protein type 9 subunit alpha
LigandBDBM217933
Substrate/Competitorn/a
Meas. Tech.ChEMBL_1662647 (CHEMBL4012328)
IC50 3±n/a nM
Citation Graceffa, RFBoezio, AAAble, JAltmann, SBerry, LMBoezio, CButler, JRChu-Moyer, MCooke, MDiMauro, EFDineen, TAFeric Bojic, EFoti, RSFremeau, RTGuzman-Perez, AGao, HGunaydin, HHuang, HHuang, LIlch, CJarosh, MKornecook, TKreiman, CRLa, DSLigutti, JMilgram, BCLin, MJMarx, IENguyen, HNPeterson, EARescourio, GRoberts, JSchenkel, LShimanovich, RSparling, BAStellwagen, JTaborn, KVaida, KRWang, JYeoman, JYu, VZhu, DMoyer, BDWeiss, MM Sulfonamides as Selective Na J Med Chem60:5990-6017 (2017) 
 
Sodium channel protein type 9 subunit alpha
Name:Sodium channel protein type 9 subunit alpha
Type:Protein
Mol. Mass.:226375.97
Organism:Homo sapiens (Human)
Description:Q15858
Residue:1988
BDBM217933
NameBDBM217933
Synonyms:US9212182, 674
TypeSmall organic molecule
Emp. Form.C25H16F3N3O5S
Mol. Mass.527.472
SMILESCOc1cc(c(F)cc1-n1c2ccc(cc2ccc1=O)S(=O)(=O)Nc1ccon1)-c1ccc(F)c(F)c1