Reaction Details
TargetCytochrome P450 11B2, mitochondrial
LigandBDBM50238115
Substrate/Competitorn/a
Meas. Tech.ChEMBL_1662800 (CHEMBL4012481)
IC50 4.00±n/a nM
Citation Meguro, MMiyauchi, SKanao, YNaito, SSuzuki, KInoue, SYamada, KHomma, TChiba, KNara, FFuruzono, S 4-Anilino-pyrimidine, novel aldosterone synthase (CYP11B2) inhibitors bearing pyrimidine structures. Bioorg Med Chem Lett27:1902-1906 (2017) 
 
Cytochrome P450 11B2, mitochondrial
Name:Cytochrome P450 11B2, mitochondrial
Type:Protein
Mol. Mass.:57582.15
Organism:Homo sapiens (Human)
Description:P19099
Residue:503
BDBM50238115
NameBDBM50238115
Synonyms:CHEMBL4082403
TypeSmall organic molecule
Emp. Form.C18H20F4N4O3S
Mol. Mass.448.435
SMILESCS(=O)(=O)N1CCC(CC1)C(O)(c1cncnc1Nc1ccc(F)cc1)C(F)(F)F