Reaction Details
TargetGlutaminase kidney isoform, mitochondrial
LigandBDBM50238195
Substrate/Competitorn/a
Meas. Tech.ChEMBL_1663490 (CHEMBL4013171)
IC50 45±n/a nM
Citation Yeh, TKKuo, CCLee, YZKe, YYChu, KFHsu, HYChang, HYLiu, YWSong, JSYang, CWLin, LMSun, MWu, SHKuo, PCShih, CChen, CTTsou, LKLee, SJ Design, Synthesis, and Evaluation of Thiazolidine-2,4-dione Derivatives as a Novel Class of Glutaminase Inhibitors. J Med Chem60:5599-5612 (2017) 
 
Glutaminase kidney isoform, mitochondrial
Name:Glutaminase kidney isoform, mitochondrial
Type:Protein
Mol. Mass.:73471.89
Organism:Homo sapiens (Human)
Description:O94925
Residue:669
BDBM50238195
NameBDBM50238195
Synonyms:CHEMBL4090687
TypeSmall organic molecule
Emp. Form.C36H23N3O4S2
Mol. Mass.625.716
SMILESO=C1NC(=O)\C(S1)=C\c1cc(-c2ccccc2)n(c1-c1ccccc1)-c1ccc(cc1)-c1ccc(\C=C2/SC(=O)NC2=O)cc1