Reaction Details
TargetAcetylcholinesterase
LigandBDBM50238212
Substrate/Competitorn/a
Meas. Tech.ChEMBL_1663576 (CHEMBL4013257)
IC50 20±n/a nM
Citation Peauger, LAzzouz, RGembus, VTîntas, MLSopková-de Oliveira Santos, JBohn, PPapamicaël, CLevacher, V Donepezil-Based Central Acetylcholinesterase Inhibitors by Means of a"Bio-Oxidizable" Prodrug Strategy: Design, Synthesis, and in Vitro Biological Evaluation. J Med Chem60:5909-5926 (2017) 
 
Acetylcholinesterase
Name:Acetylcholinesterase
Type:Enzyme
Mol. Mass.:67792.70
Organism:Homo sapiens (Human)
Description:P22303
Residue:614
BDBM50238212
NameBDBM50238212
Synonyms:CHEMBL4077952
TypeSmall organic molecule
Emp. Form.C15H17N2O4
Mol. Mass.289.3059
SMILESCOC(=O)c1c[n+](C)c2cccc(OC(=O)N(C)C)c2c1