Reaction Details
TargetAcetylcholinesterase
LigandBDBM50117592
Substrate/Competitorn/a
Meas. Tech.ChEMBL_1663551 (CHEMBL4013232)
IC50 37±n/a nM
Citation Peauger, LAzzouz, RGembus, VTîntas, MLSopková-de Oliveira Santos, JBohn, PPapamicaël, CLevacher, V Donepezil-Based Central Acetylcholinesterase Inhibitors by Means of a"Bio-Oxidizable" Prodrug Strategy: Design, Synthesis, and in Vitro Biological Evaluation. J Med Chem60:5909-5926 (2017) 
 
Acetylcholinesterase
Name:Acetylcholinesterase
Type:Enzyme
Mol. Mass.:67792.70
Organism:Homo sapiens (Human)
Description:P22303
Residue:614
BDBM50117592
NameBDBM50117592
Synonyms:1-Benzyl-4-(5,6-dimethoxy-1-oxo-indan-2-ylmethyl)-pyridinium | CHEMBL87632
TypeSmall organic molecule
Emp. Form.C24H24NO3
Mol. Mass.374.4517
SMILESCOc1cc2CC(Cc3cc[n+](Cc4ccccc4)cc3)C(=O)c2cc1OC