Reaction Details
TargetHexokinase-4
LigandBDBM50239043
Substrate/Competitorn/a
Meas. Tech.ChEMBL_1664963 (CHEMBL4014759)
EC50 232±n/a nM
Citation Xu, JLin, SMyers, RWAddona, GBerger, JPCampbell, BChen, HSChen, ZEiermann, GJElowe, NHFarrer, BTFeng, WFu, QKats-Kagan, RKavana, MMalkani, SMcMasters, DRMitra, KPachanski, MJTong, XTrujillo, MEXu, LZhang, BZhang, FZhang, RParmee, ER Novel, highly potent systemic glucokinase activators for the treatment of Type 2 Diabetes Mellitus. Bioorg Med Chem Lett27:2069-2073 (2017) 
 
Hexokinase-4
Name:Hexokinase-4
Type:PROTEIN
Mol. Mass.:52101.81
Organism:Rattus norvegicus
Description:ChEMBL_1279785
Residue:465
BDBM50239043
NameBDBM50239043
Synonyms:CHEMBL4067037
TypeSmall organic molecule
Emp. Form.C28H24F3N3O4
Mol. Mass.523.5031
SMILESCCOC(=O)c1ccc(Oc2cc3cc([nH]c3cc2C2CCC(=O)N2C)-c2ccc(cn2)C(F)(F)F)cc1