Reaction Details
TargetMitogen-activated protein kinase 14
LigandBDBM50240897
Substrate/Competitorn/a
Meas. Tech.Kinase Assay
Temperature310.15±0 K
IC50 1.23e+4± 7e+2 nM
Citation Goettert, MSchattel, VKoch, PMerfort, ILaufer, S Biological evaluation and structural determinants of p38α mitogen-activated-protein kinase and c-Jun-N-terminal kinase 3 inhibition by flavonoids. Chembiochem11:2579-88 (2010) 
 
Mitogen-activated protein kinase 14
Name:Mitogen-activated protein kinase 14
Type:Serine/threonine-protein kinase
Mol. Mass.:41286.76
Organism:Homo sapiens (Human)
Description:Q16539
Residue:360
BDBM50240897
NameBDBM50240897
Synonyms:2-(3,4-dihydroxyphenyl)-5-hydroxy-3,7-dimethoxy-4H-chromen-4-one CHEMBL164861 | Quercetin-3,7-dimethylether
TypeSmall organic molecule
Emp. Form.C17H14O7
Mol. Mass.330.2889
SMILESCOc1cc(O)c2c(c1)oc(-c1ccc(O)c(O)c1)c(OC)c2=O