Reaction Details
TargetMitogen-activated protein kinase 14
LigandBDBM23414
Substrate/Competitorn/a
Meas. Tech.Kinase Assay
Temperature310.15±0 K
IC50 2.32e+4± 7e+2 nM
Citation Goettert, MSchattel, VKoch, PMerfort, ILaufer, S Biological evaluation and structural determinants of p38α mitogen-activated-protein kinase and c-Jun-N-terminal kinase 3 inhibition by flavonoids. Chembiochem11:2579-88 (2010) 
 
Mitogen-activated protein kinase 14
Name:Mitogen-activated protein kinase 14
Type:Serine/threonine-protein kinase
Mol. Mass.:41286.76
Organism:Homo sapiens (Human)
Description:Q16539
Residue:360
BDBM23414
NameBDBM23414
Synonyms:5,7-dihydroxy-2-(3-hydroxy-4-methoxyphenyl)-4H-chromen-4-one Diosmetin (25)
Typeflavone
Emp. Form.C16H12O6
Mol. Mass.300.2629
SMILESCOc1ccc(cc1O)-c1cc(=O)c2c(O)cc(O)cc2o1