Reaction Details
TargetMitogen-activated protein kinase 14
LigandBDBM19459
Substrate/Competitorn/a
Meas. Tech.Kinase Assay
Temperature310.15±0 K
IC50 6.14e+4± 6.3e+3 nM
Citation Goettert, MSchattel, VKoch, PMerfort, ILaufer, S Biological evaluation and structural determinants of p38α mitogen-activated-protein kinase and c-Jun-N-terminal kinase 3 inhibition by flavonoids. Chembiochem11:2579-88 (2010) 
 
Mitogen-activated protein kinase 14
Name:Mitogen-activated protein kinase 14
Type:Serine/threonine-protein kinase
Mol. Mass.:41286.76
Organism:Homo sapiens (Human)
Description:Q16539
Residue:360
BDBM19459
NameBDBM19459
Synonyms:5,7-dihydroxy-3-(4-hydroxyphenyl)-4H-chromen-4-one Genistein Genisteol US8552057, 2 | cid_5280961
TypePhytoestrogen
Emp. Form.C15H10O5
Mol. Mass.270.2369
SMILESOc1ccc(cc1)-c1coc2cc(O)cc(O)c2c1=O