Reaction Details
TargetUDP-N-acetylmuramoyl-L-alanyl-D-glutamate--L-lysine ligase
LigandBDBM85279
Substrate/Competitorn/a
Meas. Tech.Enzymatic Assay
pH8±0
Temperature310.15±0 K
IC50 6.1e+4±n/a nM
Citation Sova, MKovac, ATurk, SHrast, MBlanot, DGobec, S Phosphorylated hydroxyethylamines as novel inhibitors of the bacterial cell wall biosynthesis enzymes MurC to MurF. Bioorg Chem37:217-22 (2009) 
 
UDP-N-acetylmuramoyl-L-alanyl-D-glutamate--L-lysine ligase
Name:UDP-N-acetylmuramoyl-L-alanyl-D-glutamate--L-lysine ligase
Type:Protein
Mol. Mass.:54095.36
Organism:Staphylococcus aureus
Description:Q2FZP6
Residue:493
BDBM85279
NameBDBM85279
Synonyms:HEA derivative, 7f
TypeSmall organic molecule
Emp. Form.C15H25N2O7PS
Mol. Mass.408.407
SMILESCCc1ccc(cc1)S(=O)(=O)NCC(CN1CCOCC1)OP(O)(O)=O