Reaction Details
TargetUDP-N-acetylmuramoyl-tripeptide--D-alanyl-D-alanine ligase
LigandBDBM50248217
Substrate/Competitorn/a
Meas. Tech.Enzymatic Assay
pH8±0
Temperature310.15±0 K
IC50 5.30e+5±n/a nM
Citation Sova, MKovac, ATurk, SHrast, MBlanot, DGobec, S Phosphorylated hydroxyethylamines as novel inhibitors of the bacterial cell wall biosynthesis enzymes MurC to MurF. Bioorg Chem37:217-22 (2009) 
 
UDP-N-acetylmuramoyl-tripeptide--D-alanyl-D-alanine ligase
Name:UDP-N-acetylmuramoyl-tripeptide--D-alanyl-D-alanine ligase
Type:Protein
Mol. Mass.:47439.03
Organism:Escherichia coli
Description:P11880
Residue:452
BDBM50248217
NameBDBM50248217
Synonyms:1-(4-Methoxyphenylsulfonamido)-3-morpholinopropan-2-yl dihydrogen phosphate HEA derivative, 7a
TypeSmall organic molecule
Emp. Form.C14H23N2O8PS
Mol. Mass.410.38
SMILESCOc1ccc(cc1)S(=O)(=O)NCC(CN1CCOCC1)OP(O)(O)=O