Reaction Details
TargetProstaglandin E2 receptor EP2 subtype
LigandBDBM22369
Substrate/Competitorn/a
Ki 18±n/a nM
CommentsPDSP_4000
Citation Chan, CCBoyce, SBrideau, CCharleson, SCromlish, WEthier, DEvans, JFord-Hutchinson, AWForrest, MJGauthier, JYGordon, RGresser, MGuay, JKargman, SKennedy, BLeblanc, YLeger, SMancini, JO'Neill, GPOuellet, MPatrick, DPercival, MDPerrier, HPrasit, PRodger, I Rofecoxib [Vioxx, MK-0966; 4-(4'-methylsulfonylphenyl)-3-phenyl-2-(5H)-furanone]: a potent and orally active cyclooxygenase-2 inhibitor. Pharmacological and biochemical profiles. J Pharmacol Exp Ther290:551-60 (1999) Prostaglandin E2 receptor EP2 subtype
Name:Prostaglandin E2 receptor EP2 subtype
Type:Enzyme
Mol. Mass.:39775.71
Organism:Homo sapiens (Human)
Description:P43116
Residue:358
BDBM22369
NameBDBM22369
Synonyms:4-(4-methanesulfonylphenyl)-3-phenyl-2,5-dihydrofuran-2-one MK 0966 US11478464, Compound Rofecoxib | US11786535, Compound Rofecoxib
TypeSmall organic molecule
Emp. Form.C17H14O4S
Mol. Mass.314.356
SMILESCS(=O)(=O)c1ccc(cc1)C1=C(C(=O)OC1)c1ccccc1