Reaction Details
TargetLeukotriene B4 receptor 2
LigandBDBM50297387
Substrate/Competitorn/a
Ki 693±n/a nM
CommentsPDSP_1117
Citation Heise, CEO'Dowd, BFFigueroa, DJSawyer, NNguyen, TIm, DSStocco, RBellefeuille, JNAbramovitz, MCheng, RWilliams, DLZeng, ZLiu, QMa, LClements, MKCoulombe, NLiu, YAustin, CPGeorge, SRO'Neill, GPMetters, KMLynch, KREvans, JF Characterization of the human cysteinyl leukotriene 2 receptor. J Biol Chem275:30531-6 (2000) 
 
Leukotriene B4 receptor 2
Name:Leukotriene B4 receptor 2
Type:Enzyme Catalytic Domain
Mol. Mass.:37964.86
Organism:Homo sapiens (Human)
Description:Leukotriene 2 0 HUMAN::Q9NPC1
Residue:358
BDBM50297387
NameBDBM50297387
Synonyms:(5S,6R,7E,9E,11Z,14Z)-6-(cystein-S-yl)-5-hydroxyicosa-7,9,11,14-tetraenoic acidS-{(1R,2E,4E,6Z,9Z)-1-[(1S)-4-carboxy-1-hydroxybutyl]pentadeca-2,4,6,9-tetraen-1-yl}-L-cysteine 5S-hydroxy,6R-(S-cysteinyl),7E,9E,11Z,14Z-eicosatetraenoic acid LTE4 | leukotriene E4
TypeSmall organic molecule
Emp. Form.C23H37NO5S
Mol. Mass.439.609
SMILESCCCCC\C=C/C\C=C/C=C/C=C/[C@@H](SC[C@H](N)C(O)=O)[C@@H](O)CCCC(O)=O