Reaction Details
TargetLeukotriene B4 receptor 2
LigandBDBM50009073
Substrate/Competitorn/a
Ki 7397±n/a nM
CommentsPDSP_1992
Citation Heise, CEO'Dowd, BFFigueroa, DJSawyer, NNguyen, TIm, DSStocco, RBellefeuille, JNAbramovitz, MCheng, RWilliams, DLZeng, ZLiu, QMa, LClements, MKCoulombe, NLiu, YAustin, CPGeorge, SRO'Neill, GPMetters, KMLynch, KREvans, JF Characterization of the human cysteinyl leukotriene 2 receptor. J Biol Chem275:30531-6 (2000) 
 
Leukotriene B4 receptor 2
Name:Leukotriene B4 receptor 2
Type:Enzyme Catalytic Domain
Mol. Mass.:37964.86
Organism:Homo sapiens (Human)
Description:Leukotriene 2 0 HUMAN::Q9NPC1
Residue:358
BDBM50009073
NameBDBM50009073
Synonyms:4-(5-cyclopentyloxycarbonylamino-1-methyl-1H-indol-3-ylmethyl)-3-methoxy-N-o-tolylsulfonylbenzamide ZAFIRLUKAST cyclopentyl 3-[2-methoxy-4-(2-methylphenylsulfonylcarbamoyl)benzyl]-1-methyl-1H-indol-5-ylcarbamate
TypeSmall organic molecule
Emp. Form.C31H33N3O6S
Mol. Mass.575.675
SMILESCOc1cc(ccc1Cc1cn(C)c2ccc(NC(=O)OC3CCCC3)cc12)C(=O)NS(=O)(=O)c1ccccc1C