Reaction Details
TargetSubstance-P receptor
LigandBDBM50105595
Substrate/Competitorn/a
Ki 0.61±n/a nM
CommentsPDSP_2010
Citation Rumsey, WLAharony, DBialecki, RAAbbott, BMBarthlow, HGCaccese, RGhanekar, SLengel, DMcCarthy, MWenrich, BUndem, BOhnmacht, CShenvi, AAlbert, JSBrown, FBernstein, PRRussell, K Pharmacological characterization of ZD6021: a novel, orally active antagonist of the tachykinin receptors. J Pharmacol Exp Ther298:307-15 (2001) Substance-P receptor
Name:Substance-P receptor
Type:G Protein-Coupled Receptor (GPCR)
Mol. Mass.:46254.43
Organism:Homo sapiens (Human)
Description:P25103
Residue:407
BDBM50105595
NameBDBM50105595
Synonyms:(R,S)-3-Cyano-naphthalene-1-carboxylic acid {2-(3,4-dichloro-phenyl)-4-[4-(2-methanesulfinyl-phenyl)-piperidin-1-yl]-butyl}-methyl-amide CHEMBL319821 | ZD6021
TypeSmall organic molecule
Emp. Form.C35H35Cl2N3O2S
Mol. Mass.632.642
SMILESCN(C[C@@H](CCN1CCC(CC1)c1ccccc1S(C)=O)c1ccc(Cl)c(Cl)c1)C(=O)c1cc(cc2ccccc12)C#N