Reaction Details
TargetDiacylglycerol O-acyltransferase 2
LigandBDBM276748
Substrate/Competitorn/a
Meas. Tech.In Vitro DGAT2 Assay
pH7.4±n/a
Temperature298.15±n/a K
IC50 14.0±n/a nM
Commentsextracted
Citation Boehm, MCabral, SDowling, MSFutatsugi, KHuard, KLee, ECLondregan, ATPolivkova, JPrice, DALi, Q Diacylglycerol acyl transferase 2 inhibitors US Patent US10071992 Publication Date 9/11/2018
 
Diacylglycerol O-acyltransferase 2
Name:Diacylglycerol O-acyltransferase 2
Type:Multi-pass membrane protein
Mol. Mass.:43848.90
Organism:Homo sapiens (Human)
Description:Q96PD7
Residue:388
BDBM276748
NameBDBM276748
Synonyms:US10071992, Example 3.5 US11034678, Example 5
TypeSmall organic molecule
Emp. Form.C21H23N5O4
Mol. Mass.409.4384
SMILESCCOc1cccnc1Oc1cncc(c1)-c1ncc(cn1)C(=O)NC(C)(C)CO