Reaction Details
TargetVasopressin V1b receptor
LigandBDBM50299343
Substrate/Competitorn/a
Ki 1.3±n/a nM
CommentsPDSP_2325
Citation Serradeil-Le Gal, CWagnon, JSimiand, JGriebel, GLacour, CGuillon, GBarberis, CBrossard, GSoubrié, PNisato, DPascal, MPruss, RScatton, BMaffrand, JPLe Fur, G Characterization of (2S,4R)-1-[5-chloro-1-[(2,4-dimethoxyphenyl)sulfonyl]-3-(2-methoxy-phenyl)-2-oxo-2,3-dihydro-1H-indol-3-yl]-4-hydroxy-N,N-dimethyl-2-pyrrolidine carboxamide (SSR149415), a selective and orally active vasopressin V1b receptor antagonist. J Pharmacol Exp Ther300:1122-30 (2002) 
 
Vasopressin V1b receptor
Name:Vasopressin V1b receptor
Type:Enzyme Catalytic Domain
Mol. Mass.:47104.48
Organism:RAT
Description:VASOPRESSIN V1B AVPR1B RAT::P48974
Residue:425
BDBM50299343
NameBDBM50299343
Synonyms:(2S,4R)-1-((R)-5-chloro-1-(2,4-dimethoxyphenylsulfonyl)-3-(2-methoxyphenyl)-2-oxoindolin-3-yl)-4-hydroxy-N,N-dimethylpyrrolidine-2-carboxamide CHEMBL582857 SSR149415
TypeSmall organic molecule
Emp. Form.C30H32ClN3O8S
Mol. Mass.630.108
SMILESCOc1ccc(c(OC)c1)S(=O)(=O)N1C(=O)[C@@](N2C[C@H](O)C[C@H]2C(=O)N(C)C)(c2cc(Cl)ccc12)c1ccccc1OC