Reaction Details
TargetSerine/threonine-protein kinase TBK1
LigandBDBM276906
Substrate/Competitorn/a
Meas. Tech.Biological Assay for TBK1 and IKKs
pH7±n/a
IC50 0.870±n/a nM
Commentsextracted
Citation Du, ZGuerrero, JAKaplan, JAKnox, Jr., JENaduthambi, DPhillips, BWVenkataramani, CWang, PWatkins, WJZablocki, J Tank-binding kinase inhibitor compounds US Patent US10072001 Publication Date 9/11/2018
 
Serine/threonine-protein kinase TBK1
Name:Serine/threonine-protein kinase TBK1
Type:protein
Mol. Mass.:83645.20
Organism:Homo sapiens (Human)
Description:Q9UHD2
Residue:729
BDBM276906
NameBDBM276906
Synonyms:US10072001, Example 105 | US10259811, Example 105
TypeSmall organic molecule
Emp. Form.C31H32N6O3
Mol. Mass.536.6242
SMILESN#Cc1cc(ccc1OC1CCOCC1)-c1ncnc2[nH]c(cc12)-c1ccc(cc1)N1CCN(CC1)C1COC1