Reaction Details
TargetSerine/threonine-protein kinase TBK1
LigandBDBM276949
Substrate/Competitorn/a
Meas. Tech.Biological Assay for TBK1 and IKKs
pH7±n/a
IC50 0.900±n/a nM
Commentsextracted
Citation Du, ZGuerrero, JAKaplan, JAKnox, Jr., JENaduthambi, DPhillips, BWVenkataramani, CWang, PWatkins, WJZablocki, J Tank-binding kinase inhibitor compounds US Patent US10072001 Publication Date 9/11/2018
 
Serine/threonine-protein kinase TBK1
Name:Serine/threonine-protein kinase TBK1
Type:protein
Mol. Mass.:83645.20
Organism:Homo sapiens (Human)
Description:Q9UHD2
Residue:729
BDBM276949
NameBDBM276949
Synonyms:US10072001, Example 125 | US10259811, Example 125
TypeSmall organic molecule
Emp. Form.C31H32N6O5
Mol. Mass.568.623
SMILESCOc1cc(ccc1N1CCOCC1)-c1cc2c(ncnc2[nH]1)-c1ccc(OC2CCN(CC2)C(=O)CO)c(c1)C#N