Reaction Details
TargetSerine/threonine-protein kinase TBK1
LigandBDBM276973
Substrate/Competitorn/a
Meas. Tech.Biological Assay for TBK1 and IKKs
pH7±n/a
IC50 1.54±n/a nM
Commentsextracted
Citation Du, ZGuerrero, JAKaplan, JAKnox, Jr., JENaduthambi, DPhillips, BWVenkataramani, CWang, PWatkins, WJZablocki, J Tank-binding kinase inhibitor compounds US Patent US10072001 Publication Date 9/11/2018
 
Serine/threonine-protein kinase TBK1
Name:Serine/threonine-protein kinase TBK1
Type:protein
Mol. Mass.:83645.20
Organism:Homo sapiens (Human)
Description:Q9UHD2
Residue:729
BDBM276973
NameBDBM276973
Synonyms:US10072001, Example 149 | US10259811, Example 149
TypeSmall organic molecule
Emp. Form.C29H28N4O4
Mol. Mass.496.557
SMILESCC(C)(O)c1ccc(cc1)-c1cc2c(ccnc2[nH]1)-c1ccc(O[C@@H]2CCN(C2)C(=O)CO)c(c1)C#N