Reaction Details
TargetSerine/threonine-protein kinase TBK1
LigandBDBM276999
Substrate/Competitorn/a
Meas. Tech.Biological Assay for TBK1 and IKKs
pH7±n/a
IC50 1.81±n/a nM
Commentsextracted
Citation Du, ZGuerrero, JAKaplan, JAKnox, Jr., JENaduthambi, DPhillips, BWVenkataramani, CWang, PWatkins, WJZablocki, J Tank-binding kinase inhibitor compounds US Patent US10072001 Publication Date 9/11/2018
 
Serine/threonine-protein kinase TBK1
Name:Serine/threonine-protein kinase TBK1
Type:protein
Mol. Mass.:83645.20
Organism:Homo sapiens (Human)
Description:Q9UHD2
Residue:729
BDBM276999
NameBDBM276999
Synonyms:US10072001, Example 176 | US10259811, Example 176
TypeSmall organic molecule
Emp. Form.C33H33F2N7O4
Mol. Mass.629.6564
SMILESOCC(=O)N1CCC(Oc2cnc(cc2C#N)-c2ccnc3[nH]c(cc23)-c2ccc(cc2)N2CCN(CC2)C2COC2)C(F)(F)C1