Reaction Details
TargetSerine/threonine-protein kinase TBK1
LigandBDBM277072
Substrate/Competitorn/a
Meas. Tech.Biological Assay for TBK1 and IKKs
pH7±n/a
IC50 0.910±n/a nM
Commentsextracted
Citation Du, ZGuerrero, JAKaplan, JAKnox, Jr., JENaduthambi, DPhillips, BWVenkataramani, CWang, PWatkins, WJZablocki, J Tank-binding kinase inhibitor compounds US Patent US10072001 Publication Date 9/11/2018
 
Serine/threonine-protein kinase TBK1
Name:Serine/threonine-protein kinase TBK1
Type:protein
Mol. Mass.:83645.20
Organism:Homo sapiens (Human)
Description:Q9UHD2
Residue:729
BDBM277072
NameBDBM277072
Synonyms:US10072001, Example 264
TypeSmall organic molecule
Emp. Form.C32H33F2N7O3
Mol. Mass.601.6463
SMILESOCC(=O)N1CCC(CC1)Oc1ccc(cc1C#N)-c1ncnc2[nH]c(cc12)-c1ccc(cc1)N1CCN(CC(F)F)CC1