Reaction Details
TargetHrh3 protein
LigandBDBM27213
Substrate/Competitorn/a
Ki 0.654±n/a nM
CommentsPDSP_2989
Citation Hancock, AABennani, YLBush, ENEsbenshade, TAFaghih, RFox, GBJacobson, PKnourek-Segel, VKrueger, KMNuss, MEPan, JBShapiro, RWitte, DGYao, BB Antiobesity effects of A-331440, a novel non-imidazole histamine H3 receptor antagonist. Eur J Pharmacol487:183-97 (2004) 
 
Hrh3 protein
Name:Hrh3 protein
Type:Enzyme Catalytic Domain
Mol. Mass.:37860.96
Organism:RAT
Description:Q5PPG3
Residue:344
BDBM27213
NameBDBM27213
Synonyms:4-[3-(4-cyclopropanecarbonylphenoxy)propyl]-1H-imidazole CHEMBL1795025 | Ciproxifan
TypeSmall organic molecule
Emp. Form.C16H18N2O2
Mol. Mass.270.3263
SMILESO=C(C1CC1)c1ccc(OCCCc2cnc[nH]2)cc1